Você não está autenticado.

Anúncio

Arch Linux Brasil está precisando de sua colaboração para realizar o pagamento do domínio e do host, para colaborar, realizar doações via [email protected]

Para mais informações: [email protected]

#1 13/02/2018 18:40:37

nemenlsk
Membro
Registrado: 06/02/2017
Mensagens: 21

Erro ao instalar o GCC5...

Olá pessoal, boa tarde!

Não consigo instalar com sucesso o GCC5, pois durante a instalação, o PACAUR me retorna:

make[6]: *** [Makefile:605: libstdc++.la] Error 139
make[6]: Leaving directory '/home/rhdosan/.cache/pacaur/gcc5/src/gcc-build/x86_64-pc-linux-gnu/libstdc++-v3/src'
make[5]: *** [Makefile:637: all-recursive] Error 1
make[5]: Leaving directory '/home/rhdosan/.cache/pacaur/gcc5/src/gcc-build/x86_64-pc-linux-gnu/libstdc++-v3/src'
make[4]: *** [Makefile:507: all-recursive] Error 1
make[4]: Leaving directory '/home/rhdosan/.cache/pacaur/gcc5/src/gcc-build/x86_64-pc-linux-gnu/libstdc++-v3'
make[3]: *** [Makefile:414: all] Error 2
make[3]: Leaving directory '/home/rhdosan/.cache/pacaur/gcc5/src/gcc-build/x86_64-pc-linux-gnu/libstdc++-v3'
make[2]: *** [Makefile:13894: all-stage1-target-libstdc++-v3] Error 2
make[2]: Leaving directory '/home/rhdosan/.cache/pacaur/gcc5/src/gcc-build'
make[1]: *** [Makefile:22897: stage1-bubble] Error 2
make[1]: Leaving directory '/home/rhdosan/.cache/pacaur/gcc5/src/gcc-build'
make: *** [Makefile:905: all] Error 2
==> ERRO: Uma falha ocorreu em build().
    Abortando...
:: falha ao construir pacote(s) gcc5

Alguém sabe o que pode estar acontecendo?

Agradeço desde já.

Offline

#2 17/02/2018 23:04:04

swatquest
Moderador
Registrado: 05/10/2010
Mensagens: 1.819

Re: Erro ao instalar o GCC5...

A instalação tem que ser feita usando o clean chroot

https://wiki.archlinux.org/index.php/De … ean_Chroot

Offline

Rodapé do site